{"text_format":"1","workbook":"xlsx","n_sheets":16,"sheets":["CoverSheet","Table of Contents","Description","Reopener","ANAR guidance","CPI","Historical","Thresholds","Inputs","EDB data","Timing","RAB","TAX","BBAR","MAR","IRR"],"not_rendered":{"charts":0,"images":4,"macros":1,"external_links":0,"defined_names":33,"comments":5,"pivot_tables":0},"unopened":[],"bounds":{"document_bytes":16777216,"sheet_cells":100000,"rows_first":2000,"rows_last":500,"rows_between":2000,"halvings":0,"cell_chars":16384,"cell_head_chars":4096},"cells_cut":0,"cells_raw":0,"read":"whole","date_system":"1900"}

{"sheet":"CoverSheet","index":0,"n_rows":14,"n_cols":3,"rows_kept":14,"cut":false,"hidden":false,"merged":[[2,0,2,3],[3,0,3,3]]}
[]
[]
["​​Reconsideration of DPP4 default price-quality path for \nWellington Electricity – Central Park 2 unforeseeable large project "]
["Final Decision"]
[]
[]
[]
[]
[]
[]
{"$rows_left_out":5}
{"sheet":"Table of Contents","index":1,"n_rows":17,"n_cols":3,"rows_kept":17,"cut":false,"hidden":false,"merged":[]}
[null,"Table of Contents"]
[]
[null,"Sheet Name","Link"]
[null,"Description","Description"]
[null,"Reopener","Reopener"]
[null,"ANAR guidance","ANAR guidance"]
[null,"CPI","CPI"]
[null,"Historical","Historical"]
[null,"Thresholds","Thresholds"]
[null,"Inputs","Inputs"]
{"$rows_left_out":8}
{"sheet":"Description","index":2,"n_rows":77,"n_cols":3,"rows_kept":77,"cut":false,"hidden":false,"merged":[]}
[null,"Description"]
[]
["General description"]
[null,1,{"$f":"\"This model contains the calculations for the '\"&CoverSheet!$A$3&\"\"&\"\"&\" – Final Decision\"","v":"This model contains the calculations for the '​​Reconsideration of DPP4 default price-quality path for \nWellington Electricity – Central Park 2 unforeseeable large project  – Final Decision"}]
[null,2,"For the DPP4 reopeners, we have added the FNARI (Forecast Net Allowable Revenue Increment) and ANARI (Actual Net Allowable Revenue Increment) terms to the reopened price path formulas for FNAR and ANAR (refer determination Schedule 1.3 and 1.6) to ensure that the impact of a reopener is properly reflected in both forecast and actual revenue calculations across the remaining regulatory period. Under the original DPP4 formulas, FNAR and ANAR were indexed only for CPI and the X-factor, which meant they could not accommodate mid-period adjustments arising from reopeners. By introducing FNARI and ANARI, we create a mechanism to incorporate the incremental revenue allowance associated with a reopener, starting from the reopener assessment year and compounding through subsequent years, while maintaining consistency with the IMs. FNARI adjusts the forecast price path by applying the reopener increment indexed for forecast CPI and X, as set out in Schedule 1.3(1A), whereas ANARI performs the equivalent adjustment for actual revenue using actual CPI and timing factors per Schedule 1.6(7A). This approach ensures that both forecast and actual revenue paths remain aligned with the amended determination and accurately recover the costs approved through the reopener process."]
[null,3,"For reopeners other than the one published in this model, an early indication of price path impacts may be obtained from entering the required data inputs in this model. This should however be used as indicative amounts only and will be subject to scrutiny and possible adjustments by Comcom."]
[null,4,"This sheet describes the model workings and instructions for use below."]
[]
["Changes since the draft decision"]
[null,1,"Both Stats NZ and the Reserve Bank have updated their data releases since the draft decision was published. The CPI sheet in this final decision financial model has been updated with actual CPI data from Stats NZ and forecast CPI changes from the Reserve Bank's February 2026 Monetary Policy Statement."]
{"$rows_left_out":68}
{"sheet":"Reopener","index":3,"n_rows":128,"n_cols":20,"rows_kept":128,"cut":false,"hidden":false,"merged":[[40,8,40,20],[41,8,41,20],[55,1,55,20],[43,8,43,20],[44,8,44,20],[48,8,48,20],[45,8,47,20],[51,1,51,20],[52,1,52,20],[53,1,53,20],[54,1,54,20],[77,8,77,20],[83,8,83,20],[78,8,78,20],[85,8,85,20],[91,8,91,20]]}
[null,"Reopener",null,null,null,null,null,null,null,null,null,null,null,null,null,null,null,null,null,{"$f":"EDB_Name","v":"Wellington Electricity"}]
[null,"This sheet needs to be followed from top to bottom to perform a reopener calculation."]
[null,"Inputs"]
[null,"Data from the original DPP4 reset financial model published 20-11-24"]
[]
[null,null,null,"Alpine Energy","Aurora Energy","EA Networks","Electricity Invercargill","Firstlight Network","Horizon Energy","Nelson Electricity","Network Tasman","Orion NZ","OtagoNet","Powerco","The Lines Company","Top Energy","Unison Networks","Vector Lines","Wellington Electricity","Selected EDB"]
[]
[null,"MAR (applicable X factor) 2026",null,73359.825616923074,null,44281.139732429561,16949.518224204665,34274.847397808648,34127.949082079838,7219.2497338727098,37178.886856943747,231403.61740068885,34648.09410168742,446158.36813099438,48646.442626418175,51690.551053624011,133360.41072976706,579388.88558384695,118695.81208155451,{"$f":"INDEX(D8:S22,,MATCH(D58,D6:S6,0))","v":118695.81208155451}]
[null,"MAR (applicable X factor) 2027",null,74827.022129261532,null,49999.606117475516,18619.723750017794,38526.299469032834,35645.960257250757,7886.4527942772256,41070.029155391472,259162.79534407548,39688.005869718865,472829.71537786518,52596.533767683337,59842.150954780511,152078.87797979714,638254.79635916592,132692.42224221141,132692.42224221141]
[null,"MAR (applicable X factor) 2028",null,76323.562571846764,null,56456.555251486308,20454.51132834455,43305.101655171675,37231.492569493275,8615.318761524326,45368.418406794743,290251.96427355084,45461.023203528173,501095.47576315393,56867.372309619241,69279.258160349404,173424.6692930414,703101.48366925726,148339.51267301303,148339.51267301303]
{"$rows_left_out":119}
{"sheet":"ANAR guidance","index":4,"n_rows":92,"n_cols":20,"rows_kept":92,"cut":false,"hidden":false,"merged":[[25,1,25,20],[24,1,24,20],[46,1,46,20],[30,1,30,20],[29,1,29,20],[27,1,27,20],[26,1,26,20],[31,1,31,20],[32,1,32,20],[33,1,33,20],[1,1,1,20],[23,8,23,20],[79,8,79,20],[78,8,78,20],[48,1,48,20],[34,1,34,20],[35,1,35,20],[36,1,36,20],[37,1,37,20],[38,1,38,20],[47,8,47,20],[63,8,63,20],[68,8,68,20],[69,8,69,20],[57,8,57,20],[28,1,28,20]]}
[null,"ANAR guidance",null,null,null,null,null,null,null,null,null,null,null,null,null,null,null,null,null,{"$f":"EDB_Name","v":"Wellington Electricity"}]
[null,"This calculation is included to provide guidance on how to calculate ANAR following a reopener. It is a simplified calculation that does not include any revenue from passthrough or recoverable costs. Results from this sheet will be indicative only and EDBs will still be required to perform their own calculation and ensure compliance with IMs. "]
[null,"Inputs"]
[null,null,"2024/25","2025/26","2026/27","2027/28","2028/29","2029/30"]
[null,{"$f":"Reopener!B31","v":"Assessment period number for DPP4 FNAR calculations"},null,1,2,3,4,5]
[null,{"$f":"Reopener!B32","v":"Assessment period number for reopener calculations"},null,{"$f":"IF(D52=\"pre- reopener\",E6-1,(IF(D52=\"reopener\",1,IF(D52=\"post- reopener\",C6+1,0))))","v":0},{"$f":"IF(E52=\"pre- reopener\",F6-1,(IF(E52=\"reopener\",1,IF(E52=\"post- reopener\",D6+1,0))))","v":1},{"$f":"IF(F52=\"pre- reopener\",G6-1,(IF(F52=\"reopener\",1,IF(F52=\"post- reopener\",E6+1,0))))","v":2},{"$f":"IF(G52=\"pre- reopener\",H6-1,(IF(G52=\"reopener\",1,IF(G52=\"post- reopener\",F6+1,0))))","v":3},{"$f":"IF(H52=\"pre- reopener\",I6-1,(IF(H52=\"reopener\",1,IF(H52=\"post- reopener\",G6+1,0))))","v":4}]
[]
[null,{"$f":"Reopener!B34","v":"Original DPP4 forecast CPI"},null,{"$f":"Reopener!D34","v":2.2744928703593015E-2},{"$f":"Reopener!E34","v":2.0000000000000018E-2},{"$f":"Reopener!F34","v":2.0000000000000018E-2},{"$f":"Reopener!G34","v":1.9999999999999796E-2},{"$f":"Reopener!H34","v":2.000000000000024E-2}]
[null,"Actual CPI",null,{"$f":"CPI!G64","v":2.9072012456208718E-2},{"$f":"CPI!H64","v":2.3981821593033192E-2},{"$f":"CPI!I64","v":1.9999999999999796E-2},{"$f":"CPI!J64","v":2.000000000000024E-2},{"$f":"CPI!K64","v":2.0000000000000018E-2},"These actual CPI values in the CPI sheet will need to be updated to calculate ANAR as actual CPI becomes available."]
[null,"Forecast ∆CPI index",1,{"$f":"C10*(1+D8)","v":1.022744928703593},{"$f":"D10*(1+E8)","v":1.0431998272776648},1.0640638238232181,1.0853451002996821,1.107052002305676]
{"$rows_left_out":83}
{"sheet":"CPI","index":5,"n_rows":65,"n_cols":14,"rows_kept":65,"cut":false,"hidden":false,"merged":[]}
[null,"CPI calculation for the ANAR calculation"]
[null,"The actual CPI values in this sheet will need to be updated annually to calculate ANAR when actual CPI data is released. The outputs from this sheet are linked to the ANAR guidance sheet."]
[null,"To update this sheet: "]
[null,"1) update the dates in cells G20 to G22"]
[null,"2) enter the latest Stats NZ actual CPI data in column C"]
[null,"3) enter the latest RBNZ CPI projection data in column I"]
[]
[]
[null,"Link to actual CPI data",null,null,"Dec 2025 CPI ex Statistics NZ, Table 1"]
[null,"Link to RBNZ CPI projection",null,null,"Feb 2026 RBNZ CPI forecast, Figure 2.15"]
{"$rows_left_out":56}
{"sheet":"Historical","index":6,"n_rows":11,"n_cols":35,"rows_kept":11,"cut":false,"hidden":false,"merged":[]}
[null,"Historical record of previous DPP4 reopeners"]
[null,"Please populate rows 7 onwards in the table below with the data from any previous DPP4 reopeners. These should all be zero if this is the first reopener. The last row will show the last reopener's values based on the sequence assigned in column C."]
[null,"Column number for lookups",null,1,2,3,4,5,6,7,8,9,10,11,12,13,14,15,16,17,18,19,20,21,22,23,24,25,26,27,28,29,30,31,32]
[null,null,"Selected",null,"Reopener","MAR",null,null,null,null,"FNARI",null,null,null,null,"Additional opex",null,null,null,null,"Additional VCA",null,null,null,null," Total opex",null,null,null,null,"Total VCA"]
[null,null,"EDB","Seq #","year","2025/26","2026/27","2027/28","2028/29","2029/30","2025/26","2026/27","2027/28","2028/29","2029/30","2025/26","2026/27","2027/28","2028/29","2029/30","2025/26","2026/27","2027/28","2028/29","2029/30","2025/26","2026/27","2027/28","2028/29","2029/30","2025/26","2026/27","2027/28","2028/29","2029/30"]
[null,"Data from Reopener",{"$f":"Reopener!D113","v":"Wellington Electricity"},{"$f":"Reopener!E113","v":1},{"$f":"Reopener!F113","v":"2026/27"},{"$f":"Reopener!D115","v":118695.81208155451},{"$f":"Reopener!E115","v":133006.6835527925},{"$f":"Reopener!F115","v":148690.83167733779},{"$f":"Reopener!G115","v":166224.45454872941},{"$f":"Reopener!H115","v":185825.64222911565},{"$f":"Reopener!D86","v":0},{"$f":"Reopener!E86","v":314.26131058108876},{"$f":"Reopener!F86","v":351.31900432481075},{"$f":"Reopener!G86","v":392.74654131479235},{"$f":"Reopener!H86","v":439.0592134666328},{"$f":"Reopener!D116","v":0},{"$f":"Reopener!E116","v":0},{"$f":"Reopener!F116","v":0},{"$f":"Reopener!G116","v":0},{"$f":"Reopener!H116","v":0},{"$f":"Reopener!D117","v":0},{"$f":"Reopener!E117","v":0},{"$f":"Reopener!F117","v":0},{"$f":"Reopener!G117","v":12479.084406917444},{"$f":"Reopener!H117","v":0},{"$f":"Reopener!D118","v":45192.983484661345},{"$f":"Reopener!E118","v":46782.328321386522},{"$f":"Reopener!F118","v":48443.687192979196},{"$f":"Reopener!G118","v":50200.368639512206},{"$f":"Reopener!H118","v":52032.749796498567},{"$f":"Reopener!D119","v":63757.498375313931},{"$f":"Reopener!E119","v":98923.984290555265},{"$f":"Reopener!F119","v":93105.213283671779},{"$f":"Reopener!G119","v":106566.57066460596},{"$f":"Reopener!H119","v":75812.503670278325}]
[null,"Previous reopeners",{"$f":"Reopener!D113","v":"Wellington Electricity"},0]
[null,null,{"$f":"Reopener!D113","v":"Wellington Electricity"},0]
[null,null,{"$f":"Reopener!D113","v":"Wellington Electricity"},0]
[]
{"$rows_left_out":2}
{"sheet":"Thresholds","index":7,"n_rows":51,"n_cols":16,"rows_kept":51,"cut":false,"hidden":false,"merged":[]}
[null,"Types of reopeners and thresholds",null,null,null,null,null,null,null,null,null,null,null,null,null,{"$f":"EDB_Name","v":"Wellington Electricity"}]
[null,"This sheet lists the different reopener types and applicable thresholds. Future versions of this model will automate the threshold calculation."]
[]
[null,"The standard threshold applies to most of the reopener types as detailed below. It is defined as effectively the lesser of:"]
[null,"  -  1% of the EDB’s forecast net allowable revenue for the DPP regulatory period, or"]
[null,"  -  $5 million for Vector Limited or Powerco Limited, or $2.5 million for any other EDB."]
[]
[null,"Reopener types"]
[null,"Reopener type number selected",{"$f":"_xlfn.XMATCH(Reopener!D61,C12:C23)","v":8}]
[]
{"$rows_left_out":42}
{"sheet":"Inputs","index":8,"n_rows":67,"n_cols":21,"rows_kept":67,"cut":false,"hidden":false,"merged":[[4,20,4,22]]}
["Inputs",null,null,null,null,null,null,null,null,null,null,null,null,null,null,null,null,null,{"$f":"EDB_Name","v":"Wellington Electricity"}]
["All input data is entered into this sheet.",null,null,null,null,null,null,null,null,null,null,null,null,null,null,null,null,null,null,null,"Working area"]
[]
["Inputs that are the same for all distributors"]
[null,null,"Base","Gap","1st","2nd","3rd","4th","5th",null,null,null,null,null,null,null,null,null,null,null,"This working area generates text for row headings below for opex, capex etc."]
[null,"Value",{"$f":"YEAR(B15)-1 & \"/\" & YEAR(B15)-2000","v":"2023/24"},{"$f":"LEFT(C6,4)+1 & \"/\" & RIGHT(C6,2)+1","v":"2024/25"},"2025/26","2026/27","2027/28","2028/29","2029/30"]
["Year in modelling period",null,1,2,3,4,5,6,7,null,null,null,null,null,null,null,null,null,null,null,{"$f":"C2","v":0}]
["Year in regulatory period",null,null,null,1,2,3,4,5,null,null,null,null,null,null,null,null,null,null,null,{"$f":"C5","v":"Base"}]
["Forecast changes in CPI used for revaluations",null,4.022988505747116E-2,2.200000000000002E-2,2.0999999999999908E-2,2.0000000000000018E-2,2.0000000000000018E-2,2.0000000000000018E-2,2.0000000000000018E-2,null,null,null,null,null,null,null,null,null,null,null,{"$f":"C6","v":"2023/24"}]
["Forecast changes in the CPI element of the price path",null,null,null,2.2744928703593015E-2,2.0000000000000018E-2,2.0000000000000018E-2,1.9999999999999796E-2,2.000000000000024E-2,null,null,null,null,null,null,null,null,null,null,null,{"$f":"LEFT(U9,4)+1 & \"/\" & RIGHT(U9,2)+1","v":"2024/25"}]
{"$rows_left_out":58}
{"sheet":"EDB data","index":9,"n_rows":72,"n_cols":8,"rows_kept":72,"cut":false,"hidden":false,"merged":[]}
["Inputs for the selected distributor",null,null,null,null,null,null,{"$f":"EDB_Name","v":"Wellington Electricity"}]
["Data from the Inputs sheet that relates to the selected distributor. The distributor's name is user-selected in cell C4."]
["Distributor",null,"Scenario"]
["Name",null,{"$f":"SelectedEDB","v":"Wellington Electricity"}]
["Distributor number",null,{"$f":"MATCH(EDB_Name,rEDBNames)","v":16}]
[]
["General data"]
["Non business-specific single inputs","Value"]
[{"$f":"Inputs!A16","v":"Vanilla WACC (65th percentile)"},{"$f":"Inputs!B16","v":7.0999999999999994E-2}]
[{"$f":"Inputs!A17","v":"Cost of debt"},{"$f":"Inputs!B17","v":5.74E-2}]
{"$rows_left_out":63}
{"sheet":"Timing","index":10,"n_rows":42,"n_cols":15,"rows_kept":42,"cut":false,"hidden":false,"merged":[]}
["Intra-year timing"]
["Derivation of the five timing factors TFopex, TFtax, TFVCA and TFrev."]
["Inputs"]
[null,"From","Value"]
["Last day of year 1 of the DPP period","EDB data",{"$f":"EOMONTH('EDB data'!$B$17,24)","v":"2026-03-31"},{"$f":"EOMONTH('EDB data'!$B$17,24)","v":"2026-03-31"}]
["Days in a year","EDB data",{"$f":"'EDB data'!B14","v":365}]
["Days from mid-year to year-end","EDB data",{"$f":"'EDB data'!B15","v":182}]
["Days from revenue date to year-end","EDB data",{"$f":"'EDB data'!B16","v":148}]
["Vanilla WACC (67th percentile)","EDB data",{"$f":"WACC","v":7.0999999999999994E-2}]
["Calculations"]
{"$rows_left_out":33}
{"sheet":"RAB","index":11,"n_rows":101,"n_cols":12,"rows_kept":101,"cut":false,"hidden":false,"merged":[]}
["Regulatory asset base",null,null,null,null,null,null,null,null,{"$f":"EDB_Name","v":"Wellington Electricity"}]
["Calculations involving the roll-forward of asset values."]
[]
["Inputs"]
[null,"From","Value",{"$f":"Inputs!C$6","v":"2023/24"},{"$f":"Inputs!D$6","v":"2024/25"},{"$f":"Inputs!E$6","v":"2025/26"},{"$f":"Inputs!F$6","v":"2026/27"},{"$f":"Inputs!G$6","v":"2027/28"},{"$f":"Inputs!H$6","v":"2028/29"},{"$f":"Inputs!I$6","v":"2029/30"}]
["Opening RAB","EDB data",{"$f":"'EDB data'!B28","v":803430.16615239112}]
["Total depreciation","EDB data",{"$f":"'EDB data'!B29","v":32360.718320962555}]
["Closing RAB","EDB data",{"$f":"'EDB data'!B30","v":847276.47559922794}]
["Disposed assets","EDB data",null,{"$f":"TRANSPOSE('EDB data'!B58:B64)","v":0},0,0,0,0,0,0]
["Value of commissioned assets","EDB data",null,{"$f":"TRANSPOSE('EDB data'!B49:B55)","v":53542.807699831377},47330.141592528431,63757.498375313931,98923.984290555265,93105.213283671779,106566.57066460596,75812.503670278325]
{"$rows_left_out":92}
{"sheet":"TAX","index":12,"n_rows":193,"n_cols":12,"rows_kept":193,"cut":false,"hidden":false,"merged":[]}
["Tax calculations",null,null,null,null,null,null,null,null,{"$f":"EDB_Name","v":"Wellington Electricity"}]
["Calculations involving the roll-forward of adjusted depreciation regulatory asset values, deferred tax and tax adjustments."]
[]
["Inputs","Source",null,{"$f":"Inputs!C$6","v":"2023/24"},{"$f":"Inputs!D$6","v":"2024/25"},{"$f":"Inputs!E$6","v":"2025/26"},{"$f":"Inputs!F$6","v":"2026/27"},{"$f":"Inputs!G$6","v":"2027/28"},{"$f":"Inputs!H$6","v":"2028/29"},{"$f":"Inputs!I$6","v":"2029/30"}]
["Year in modelling period","EDB data",null,{"$f":"'EDB data'!B20","v":1},{"$f":"'EDB data'!C20","v":2},{"$f":"'EDB data'!D20","v":3},{"$f":"'EDB data'!E20","v":4},{"$f":"'EDB data'!F20","v":5},{"$f":"'EDB data'!G20","v":6},{"$f":"'EDB data'!H20","v":7}]
["Tax rate","EDB data",null,{"$f":"'EDB data'!B24","v":0.28000000000000003},{"$f":"'EDB data'!C24","v":0.28000000000000003},{"$f":"'EDB data'!D24","v":0.28000000000000003},{"$f":"'EDB data'!E24","v":0.28000000000000003},{"$f":"'EDB data'!F24","v":0.28000000000000003},{"$f":"'EDB data'!G24","v":0.28000000000000003},{"$f":"'EDB data'!H24","v":0.28000000000000003}]
["Value of commissioned assets","EDB data",null,{"$f":"TRANSPOSE('EDB data'!B49:B55)","v":53542.807699831377},47330.141592528431,63757.498375313931,98923.984290555265,93105.213283671779,106566.57066460596,75812.503670278325]
["Remaining life of newly commissioned assets","EDB data",null,{"$f":"'EDB data'!B12","v":44}]
["Amortisation of initial differences in asset values","EDB data",null,{"$f":"'EDB data'!B35","v":7150.7843480592646}]
["Disposed assets","EDB data",null,{"$f":"'EDB data'!$B58","v":0},{"$f":"'EDB data'!$B59","v":0},{"$f":"'EDB data'!$B60","v":0},{"$f":"'EDB data'!$B61","v":0},{"$f":"'EDB data'!$B62","v":0},{"$f":"'EDB data'!$B63","v":0},{"$f":"'EDB data'!$B64","v":0}]
{"$rows_left_out":184}
{"sheet":"BBAR","index":13,"n_rows":141,"n_cols":13,"rows_kept":141,"cut":false,"hidden":false,"merged":[]}
["Building block allowable revenue",null,null,null,null,null,null,null,null,null,{"$f":"EDB_Name","v":"Wellington Electricity"}]
["This sheet calculates the building blocks allowable revenue for each year of the regulatory period."]
["Inputs"]
[null,"Source","Value",{"$f":"Inputs!C$6","v":"2023/24"},{"$f":"Inputs!D$6","v":"2024/25"},{"$f":"Inputs!E$6","v":"2025/26"},{"$f":"Inputs!F$6","v":"2026/27"},{"$f":"Inputs!G$6","v":"2027/28"},{"$f":"Inputs!H$6","v":"2028/29"},{"$f":"Inputs!I$6","v":"2029/30"}]
["Year in regulatory period","EDB data",null,null,null,{"$f":"'EDB data'!D21","v":1},{"$f":"'EDB data'!E21","v":2},{"$f":"'EDB data'!F21","v":3},{"$f":"'EDB data'!G21","v":4},{"$f":"'EDB data'!H21","v":5}]
["Tax rate","EDB data",null,{"$f":"'EDB data'!B24","v":0.28000000000000003},{"$f":"'EDB data'!C24","v":0.28000000000000003},{"$f":"'EDB data'!D24","v":0.28000000000000003},{"$f":"'EDB data'!E24","v":0.28000000000000003},{"$f":"'EDB data'!F24","v":0.28000000000000003},{"$f":"'EDB data'!G24","v":0.28000000000000003},{"$f":"'EDB data'!H24","v":0.28000000000000003}]
["Term credit spread differential allowance","EDB data",null,{"$f":"RAB!D100","v":375.81537252885653},{"$f":"RAB!E100","v":396.32507929987793},{"$f":"RAB!F100","v":411.81268894706466},{"$f":"RAB!G100","v":434.40964504843436},{"$f":"RAB!H100","v":473.6591119968536},{"$f":"RAB!I100","v":510.05695604958487},{"$f":"RAB!J100","v":552.51025944751814}]
["Value of commissioned assets","EDB data",null,{"$f":"TRANSPOSE('EDB data'!B49:B55)","v":53542.807699831377},47330.141592528431,63757.498375313931,98923.984290555265,93105.213283671779,106566.57066460596,75812.503670278325]
["Operating expenditure","EDB data",null,null,null,{"$f":"TRANSPOSE('EDB data'!B42:B46)","v":45192.983484661345},46782.328321386522,48443.687192979196,50200.368639512206,52032.749796498567]
[]
{"$rows_left_out":132}
{"sheet":"MAR","index":14,"n_rows":39,"n_cols":10,"rows_kept":39,"cut":false,"hidden":false,"merged":[[1,0,1,7]]}
["Maximum allowable revenue",null,null,null,null,null,null,{"$f":"EDB_Name","v":"Wellington Electricity"}]
["This sheet derives the starting prices. It calculates the set of 5 MAR values such that the present value of this MAR time series is equal to the present value of the 5 BBAR values calculated in the BBAR sheet."]
["Inputs"]
[null,"Source","Value",{"$f":"Inputs!E$6","v":"2025/26"},{"$f":"Inputs!F$6","v":"2026/27"},{"$f":"Inputs!G$6","v":"2027/28"},{"$f":"Inputs!H$6","v":"2028/29"},{"$f":"Inputs!I$6","v":"2029/30"}]
["Year in regulatory period","EDB data",null,{"$f":"'EDB data'!D21","v":1},{"$f":"'EDB data'!E21","v":2},{"$f":"'EDB data'!F21","v":3},{"$f":"'EDB data'!G21","v":4},{"$f":"'EDB data'!H21","v":5}]
["Industry-wide X factor","EDB data",{"$f":"'EDB data'!B13","v":0}]
[{"$f":"'EDB data'!A39","v":"Additional allowance (PV at 1-Apr-25)"},"EDB data",{"$f":"'EDB data'!B39","v":0}]
["Alternative X factor","EDB data",{"$f":"'EDB data'!B40","v":-9.6000000000000002E-2}]
["Forecast changes in the CPI element of the price path","EDB data",null,{"$f":"'EDB data'!D23","v":2.2744928703593015E-2},{"$f":"'EDB data'!E23","v":2.0000000000000018E-2},{"$f":"'EDB data'!F23","v":2.0000000000000018E-2},{"$f":"'EDB data'!G23","v":1.9999999999999796E-2},{"$f":"'EDB data'!H23","v":2.000000000000024E-2}]
["Vanilla WACC (67th percentile)","EDB data",{"$f":"WACC","v":7.0999999999999994E-2}]
{"$rows_left_out":30}
{"sheet":"IRR","index":15,"n_rows":47,"n_cols":19,"rows_kept":47,"cut":false,"hidden":false,"merged":[]}
["Internal rate of return",null,null,null,null,null,null,null,null,null,null,null,null,null,null,null,null,null,{"$f":"EDB_Name","v":"Wellington Electricity"}]
["This sheet calculates the internal rate of return for the selected EDB. It should be equal to the 65th percentile of the vanilla WACC."]
["Inputs"]
[null,"Source","Value",{"$f":"'EDB data'!D19","v":"2025/26"},{"$f":"'EDB data'!E19","v":"2026/27"},{"$f":"'EDB data'!F19","v":"2027/28"},{"$f":"'EDB data'!G19","v":"2028/29"},{"$f":"'EDB data'!H19","v":"2029/30"}]
["Vanilla WACC (67th percentile)","EDB Data",{"$f":"WACC","v":7.0999999999999994E-2}]
["Aggregate opening RAB value","RAB",null,{"$f":"RAB!F97","v":880386.38461761747},{"$f":"RAB!G97","v":928694.88267850433},{"$f":"RAB!H97","v":1012603.6529333453},{"$f":"RAB!I97","v":1090416.132231619},{"$f":"RAB!J97","v":1181174.1668835955}]
["Opening deferred tax","TAX",null,{"$f":"TAX!F183","v":-56871.708837389597},{"$f":"TAX!G183","v":-61180.724905034571},{"$f":"TAX!H183","v":-66262.64612599845},{"$f":"TAX!I183","v":-72291.233113105045},{"$f":"TAX!J183","v":-79020.982209650218}]
["Maximum allowable revenue before tax in revenue-date terms","MAR",null,{"$f":"MAR!D38","v":118695.81208155451},{"$f":"MAR!E38","v":133006.6835527925},{"$f":"MAR!F38","v":148690.83167733779},{"$f":"MAR!G38","v":166224.45454872941},{"$f":"MAR!H38","v":185825.64222911565}]
["Operating expenditure","EDB data",null,{"$f":"'EDB data'!B42","v":45192.983484661345},{"$f":"'EDB data'!B43","v":46782.328321386522},{"$f":"'EDB data'!B44","v":48443.687192979196},{"$f":"'EDB data'!B45","v":50200.368639512206},{"$f":"'EDB data'!B46","v":52032.749796498567}]
["Depreciation","RAB",null,{"$f":"RAB!F96","v":33919.620210293426},{"$f":"RAB!G96","v":33572.757909388958},{"$f":"RAB!H96","v":35528.747014129229},{"$f":"RAB!I96","v":37601.091357666897},{"$f":"RAB!J96","v":39991.861515562814}]
{"$rows_left_out":37}